{"text_format":"1","workbook":"xlsx","n_sheets":14,"sheets":["Page de garde","Identification de l'entreprise","Démarche","Cotation","Unités de travail","Référents actions","DOCUMENT UNIQUE A COMPLETER","RPS","Facteurs de pénibilité","Paramètres 1","Paramètres 2","Paramètres 3","Paramètres RPS","Paramètres COVID-19"],"not_rendered":{"charts":0,"images":9,"macros":1,"external_links":0,"defined_names":62,"comments":2,"pivot_tables":0},"unopened":[],"bounds":{"document_bytes":16777216,"sheet_cells":100000,"rows_first":2000,"rows_last":500,"rows_between":2000,"halvings":0,"cell_chars":16384,"cell_head_chars":4096},"cells_cut":0,"cells_raw":0,"read":"whole","date_system":"1900"}

{"sheet":"Page de garde","index":0,"n_rows":4,"n_cols":2,"rows_kept":4,"cut":false,"hidden":false,"merged":[]}
[]
[]
[]
[null,"L'AIST87 n'est plus responsable de l'outil dès lors qu'il a été téléchargé et utilisé par l'entreprise."]

{"sheet":"Identification de l'entreprise","index":1,"n_rows":12,"n_cols":6,"rows_kept":12,"cut":false,"hidden":false,"merged":[[8,1,8,2],[8,5,8,6],[8,3,8,4],[11,1,11,2],[11,3,11,6],[9,1,9,2],[9,3,9,4],[9,5,9,6],[10,1,10,2],[10,3,10,6],[5,1,5,6],[6,1,6,2],[6,3,6,6],[7,1,7,2],[7,3,7,6]]}
[]
[]
[]
[]
[]
[null,"L'identification de l'entreprise"]
[null,"Nom de l'entreprise"]
[null,"Adresse"]
[null,"Document unique élaboré par ",null,null,null,"Fonction : "]
[null,"Document unique validé par",null,null,null,"Fonction : "]
{"$rows_left_out":3}
{"sheet":"Démarche","index":2,"n_rows":22,"n_cols":4,"rows_kept":22,"cut":false,"hidden":false,"merged":[[19,3,19,6],[21,1,21,2],[21,3,21,6],[16,3,16,6],[20,3,20,6],[16,1,18,2],[19,1,20,2],[6,1,6,6],[7,3,7,6],[11,3,11,6],[7,1,10,2],[14,3,14,6],[11,1,13,2],[14,1,15,2],[15,3,15,6],[12,3,12,6],[8,3,8,6],[9,3,9,6],[10,3,10,6]]}
[]
[]
[]
[]
[]
[]
[null,"La démarche"]
[null,"1. Préparer l'évaluation",null,"groupe de travail: CHSCT/reférent santé sécurité"]
[null,null,null,"unité de travail choisie : pôle d'activité"]
[null,null,null,"la méthoded'évaluation : fréquence en nombre d'occurrences x gravité du risque"]
{"$rows_left_out":13}
{"sheet":"Cotation","index":3,"n_rows":26,"n_cols":9,"rows_kept":26,"cut":false,"hidden":false,"merged":[[25,8,26,13],[19,1,19,13],[25,7,26,7],[25,1,26,1],[25,2,26,2],[25,3,26,3],[25,4,26,4],[25,5,26,5],[21,8,22,13],[23,7,24,7],[23,8,24,13],[13,7,13,13],[14,7,14,13],[15,7,15,13],[21,7,22,7],[11,1,15,2],[11,3,11,6],[11,7,11,13],[12,3,12,6],[13,3,13,6],[14,3,14,6],[15,3,15,6],[12,7,12,13],[6,1,6,13],[7,3,7,13],[8,3,8,13],[9,3,9,13],[7,1,10,2],[10,3,10,13]]}
[]
[]
[]
[]
[]
[]
[null,"La cotation de la criticité & définition des priorités d'action"]
[null,"Fréquence probable d'apparition du risque (en nombre d'occurrences)                      \"combien de fois un salarié est-il exposé?\"",null,"Niveau 1 TRES RARE                = moins d'1 fois/mois"]
[null,null,null,"Niveau 2 RARE                           = moins d'1 fois/semaine"]
[null,null,null,"Niveau 3 FREQUENT               = moins d'1 fois/jour"]
{"$rows_left_out":17}
{"sheet":"Unités de travail","index":4,"n_rows":13,"n_cols":5,"rows_kept":13,"cut":false,"hidden":false,"merged":[[8,1,8,4]]}
[]
[]
[]
[]
[]
[]
[]
[]
[null,"Les unités de travail"]
[]
{"$rows_left_out":4}
{"sheet":"Référents actions","index":5,"n_rows":11,"n_cols":4,"rows_kept":11,"cut":false,"hidden":false,"merged":[]}
[]
[]
[null,"Les référents des actions"]
[]
[null,"Ajouter la liste des salariés de votre entreprise"]
[]
[null,null,null,"Nom Prénom"]
[]
[null,null,null,"Monsieur x"]
[null,null,null,"Référent 2"]
{"$rows_left_out":2}
{"sheet":"DOCUMENT UNIQUE A COMPLETER","index":6,"n_rows":403,"n_cols":15,"rows_kept":403,"cut":false,"hidden":false,"merged":[[2,11,2,14],[0,0,0,2],[2,1,2,3],[2,4,2,6],[2,10,3,10],[2,7,2,9]]}
["Unité de travail : ",null,null,"Homme(s) :",1,"Femme(s) :",2]
[]
[null,"Identification du risque",null,null,"Cotation sexe masculin",null,null,"Cotation sexe féminin",null,null,"Mesures de prévention existantes","Plan de prévention"]
["Phase de travail","Doc.","Risque","Danger","Fréquence","Gravité","Priorité","Fréquence","Gravité","Priorité",null,"Mesure de prévention à mettre en place","Référent de l'action","Délai d'exécution","Réalisée le"]
[null,{"$f":"IF(C5<>\"\",HYPERLINK((VLOOKUP(TRIM(C5),'Paramètres 3'!A:B,2,FALSE)),\"Lien\"),\"\")","v":""},null,null,null,null,null,null,null,{"$f":"H5*I5","v":0}]
[null,{"$f":"IF(C6<>\"\",HYPERLINK((VLOOKUP(TRIM(C6),'Paramètres 3'!A:B,2,FALSE)),\"Lien\"),\"\")","v":""},null,null,null,null,{"$f":"E6*F6","v":0},null,null,{"$f":"H6*I6","v":0}]
[null,{"$f":"IF(C7<>\"\",HYPERLINK((VLOOKUP(TRIM(C7),'Paramètres 3'!A:B,2,FALSE)),\"Lien\"),\"\")","v":""},null,null,null,null,{"$f":"E7*F7","v":0},null,null,{"$f":"H7*I7","v":0}]
[null,{"$f":"IF(C8<>\"\",HYPERLINK((VLOOKUP(TRIM(C8),'Paramètres 3'!A:B,2,FALSE)),\"Lien\"),\"\")","v":""}]
[null,{"$f":"IF(C9<>\"\",HYPERLINK((VLOOKUP(TRIM(C9),'Paramètres 3'!A:B,2,FALSE)),\"Lien\"),\"\")","v":""}]
[null,null,null,null,null,null,0,null,null,{"$f":"H10*I10","v":0}]
{"$rows_left_out":394}
{"sheet":"RPS","index":7,"n_rows":24,"n_cols":11,"rows_kept":24,"cut":false,"hidden":false,"merged":[[0,0,0,1],[2,1,2,2],[2,3,2,5],[2,6,3,6],[2,7,2,10]]}
["Unité de travail",null,"Nombre de salariés :",1]
[]
[null,null,null,"Cotation ",null,null,"Mesures de prévention existantes","Plan de prévention"]
["Phase de travail","Risque","Danger","Fréquence","Gravité","Priorité",null,"Mesure de prévention à mettre en place","Référent de l'action","Délai d'exécution","Réalisée le"]
[null,"Risques liés aux exigences émotionnelles","Manque de reconnaissance (Rémunération, statut, perspectives de carrière proposées )\n",null,null,{"$f":"D5*E5","v":0}]
[null,"Risques liés aux conflits de valeur","Postes de travail soumis aux ultraviolets",null,null,0]
[null,"Risques liés aux exigences émotionnelles","actes de violence vécus",null,null,{"$f":"D7*E7","v":0}]
[null,"Risques liés à l'intensité et à la complexicité du travail","Contraintes de rythmes élevés",null,null,0]
[null,null,null,null,null,0]
[null,null,null,null,null,0]
{"$rows_left_out":15}
{"sheet":"Facteurs de pénibilité","index":8,"n_rows":47,"n_cols":7,"rows_kept":47,"cut":false,"hidden":false,"merged":[[17,3,19,3],[20,1,22,1],[20,2,22,3],[4,1,4,6],[10,1,13,1],[10,2,10,4],[11,2,13,2],[11,3,13,3],[14,1,19,1],[17,2,19,2],[29,1,30,1],[29,2,29,4],[23,1,25,1],[23,2,24,2],[23,3,24,3],[43,2,43,3],[31,3,31,4],[32,1,34,1],[32,2,34,2],[32,3,34,3],[35,2,35,3],[36,1,37,1],[36,2,36,3],[37,2,37,3],[41,1,42,1],[41,2,41,4],[44,2,44,3],[45,1,46,1],[45,2,45,3],[45,4,46,4],[46,2,46,3],[45,6,46,6],[11,5,13,5],[11,6,13,6],[32,5,34,5],[32,6,34,6],[14,6,16,6],[17,6,19,6],[20,6,22,6],[23,6,25,6],[45,5,46,5],[14,5,16,5],[17,5,19,5],[20,5,22,5],[23,5,25,5]]}
[]
[]
[]
[]
[null,"Proportion des salariés exposés aux facteurs de pénibilité au-delà des seuils prévus à l'article D. 4161-2 du Code du travail"]
[]
[null,"dans l'évaluation des risques, les facteurs de pénibilité sont identifiés par un asterisque  *"]
[]
[null,"1. liés à des contraintes physiques marquées"]
[]
{"$rows_left_out":38}
{"sheet":"Paramètres 1","index":9,"n_rows":15,"n_cols":26,"rows_kept":15,"cut":false,"hidden":false,"merged":[]}
[null,"Risque lié au bruit*","Risque lié à l'éclairage","Risques thermiques*","Risques vibrations*","Risques rayonnements","Risques chimiques*","Risques liés au Covid-19","Risques biologiques","Risques liés à la manutention manuelle *","Risques liés aux circulations et aux déplacements dans l’entreprise","Risques liés au travail sur écran","Risques liés à la circulation routière","Risques psychosociaux","Risques liés à la malveillance","Risques de chute de plain pied","Risques liés aux chutes de hauteur","Risques liés aux machines et aux outils","Risques liés à l’électricité","Risques d’incendie ou d’explosion","Risques liés aux interventions d’entreprises extérieures","Risques liés à l’emploi d’intérimaires / stagiaires","Risques liés au travail sur des sites extérieurs","Risques liés à la manutention mécanique","Risques liés aux addictions","Risques liés aux activités exercées en milieu hyperbare*"]
[]
[null,"La communication orale est gênée ","L'éclairage entraîne des postures contraignantes au poste de travail*","Système de climatisation defectueux","Utilisation d’outils pneumatiques à main ","Postes de travail soumis aux ultraviolets","Présence d’agents chimiques faisant l’objet d’une Valeur limite d’Exposition Professionnelle (benzène, poussière de bois, chlorure de vinyle, plomb et ses composés, …)*","Exposition des salariés au Covid-19","Salariés en contacts avec des agents biologiques pathogènes (bactéries, virus, champignons …)","Manutention de charge de poids élevé*","Zones de circulation communes aux piétons et aux véhicules non balisées","Source lumineuse arrivant sur l'écran et perturbant le travail","Salariés effectuent  régulièrement des déplacements professionnels ","Voir feuille RPS","Salariés en contact avec le public ","Sol défectueux (revêtement dégradé, trou…)","Objets stockés en hauteur (racks de stockage)","Utilisation d’outils tranchants (couteaux, cutters..)","conducteur nu accessible","Zones à risque d’explosion non définies et non délimitées ","Absence de plan de prévention ","Absence de sensibilisation générale à la sécurité ","Postes de travail permanents situés sur des sites extérieurs ","Les appareils de manutention ne sont pas vérifiés","Récurrence des évènements avec consommation d’alcool"]
[null,"Exposition sonore quotidienne supérieure à 80 dB (A)","Local aveugle","Ambiances froides (à partir de 11°c) ","Utilisation d’outils vibrants *","Postes de travail soumis à des rayonnements électromagnétiques ","Emissions de fumées (soudure, gaz d’échappement), poussières (ciment, farine, sciure), gaz, produits volatils…","Le personnel a été exposé lors d'une intervention chez un client diagnostiqué positif au Covid-19 ou par un de ses collégues.","Salariés en contacts avec des animaux ou leurs produits (escréments, sang …)","Manutention effectuée de façon répétitive et à cadence élevée","Voie de circulation dangereuse (étroite, en pente…)","Mobilier inadapté entraînant l'adoption de postures contraignantes ","Véhicules utilisés non adaptés à l’activité ",null,"L’établissement contient  des valeurs  ","Sol glissant (produits répandus)","objets empilés sur de grandes hauteurs, matériaux en vrac..","Utilisation d’outils ou machines pouvant provoquer des brûlures ","Matériel électrique défectueux ","utilisation de produits comburants, inflammables, explosifs","Méconnaisssance des risques liés à la coactivité","Absence de formation au poste de travail","Salariés non informés des risques du site de travail ","Les utilisateurs des appareils de manutention ne sont pas formés et/ou recyclés"," Activités de l’entreprise et/ou fonction du salarié facilitant l’accès aux substances psychoactives"]
[null,"Bruit susceptible de couvrir un signal sonore de sécurité"," Poste de travail présentant des zones éblouissantes","Ambiances chaudes (inférieur à 30°c, proximité de matériel ou de matériau à température élevée)","Utilisation de véhicules P. L. ou d’engins de chantier","Postes de travail soumis à des rayonnements laser classe 2, 3, ou 4 ","Utilisation de produits dangereux (toxiques, corrosifs,…)","Absence du personnel","Employés en contacts avec des cadavres (travaux funéraires, équarrissage, …) ","Charge difficile à manutentionner (grande dimension, arêtes vives…)","Zone de manœuvre (chargement, demi tour..) dangereuse (manque de visibilité…)","Impossibilité de régler certains paramètres (couleur d'écran, taille des caractères...)","Entretien des véhicules non réalisé",null,"Protection mécanique absente ou en dysfonctionnement (rideaux de fer, grille …)","sol inégal (marche, pente..)","travaux effectués à plus de 3 mètres ","fluide (liquide sous pression…), matière (poussières…)pouvant être projetés","armoire électrique non fermée à clef","création d'atmosphère explosive avec l'air (produit volatil tel que solvant, poussières…)","Autres risques","EPI non fournis","Situations de coactivité","Personne conduisant un chariot automoteur sans autorisation de conduite","Conditions de travail générant une consommation de SPA : présence de facteurs de risques psychosociaux"]
[null,"Présence de sources de bruit génantes dans les locaux","Zone de passage peu ou pas éclairée","Températures extrêmes*( supérieur à 30°c ou inférieur à 10°c ; 6H/jour)","Utilisation des chariots élévateurs ","Postes de travail soumis à des rayonnements ionisants","Utilisation de produits Cancérogènes Mutagènes Reprotoxiques (CMR)","Absence d'équipement de protection individuel","Absence d’information sur la marche à suivre en cas d’accident","Manutention sur des distances importantes","Plan de circulation dans l’entreprise non établi.","Difficulté à utiliser le logiciel (défaut de formation ...)","stationnement difficile",null,"Moyens de détection absent ou en dysfonctionnement (alarmes, …) ","Passage encombré par l'entreposage d'objets divers","zone présentant des parties en contrebas (escalier, quai, fosse…)","non consignation d'une machine lors de sa réparation ou de sa maintenance","non consignation d'une installation électrique lors d'une intervention","Autres risques",null,"Autres risques","Autres risques","Moyen de manutention inadapté à la tâche"]
[null,"bruit impulsionnel et/ou répétitif","Eclairage inadapté au travail à effectuer","Exposition aux courants d’air","Siège des engins dégradés ou n'ayant pas été contrôlé depuis plus de 4 ans.","Autres risques","Salariés non formés à l'utilisation des produits.","Mode de fonctionnement dégradé","Absence d’EPI ou non portés","Manutention dans un environnement particulier (froid, chaud,…)","Absence de protocole de sécurité pour les opérations de chargement et de déchargement.","Travail sur écran en continu (absence d'alternance des tâches)","Absence de plan de circulation au sein de l’entreprise",null,"violences physiques ou verbales d’origine externe ","Autres risques","utilisation de dispositifs mobiles (escabeau, échaffaudage…)","utilisation d'une machine et/ou outil de façon répétitive et à cadence élevée","personne intervenant sur des installations électriques non habilitée",null,null,null,null,"Instabilité de la charge"]
[null,"E.P.I non fournis ","Présence de luminaires défectueux","Exposition à l’humidité","Autres risques",null,"Absence d’EPI (gants, lunettes, masques, …)","autres","Dysfonctionnement ou absence de la VMC","Postures pénibles (dos courbé, charge éloignée du corps…)*","Mauvais état des véhicules (freins, pneumatiques, feux de signalisation…)","Espace insuffisant (bureau trop petit, dégagement à l'arrière du poste de travail …)","Contraintes de communication durant les déplacements ",null,"absence de protocole de gestion des incidents liés à la malveillance ",null,"utilisation de moyens de fortune (chaise, empilement d'objets divers…)","Autres risques","vérification électrique périodique non faite ",null,null,null,null,"Autres risques"]
[null,"Autres risques","Autres risques","Exposition aux intempéries",null,null,"L'inventaire des produits utilisés n'est pas réalisé ",null,"Salariés en contacts avec des déchets, des eaux usées (personnel de ménage, ramassage des déchets, stations d’épuration, …)","Absence d'aide à la manutention","Contraintes imposées (délai, trajet…) empêchant le respect des règles de sécurité","Autres risques","véhicule non équipé pour les intempéries (neige, verglas …)",null,"Autres risques",null,"montée ou descente répétée d'un escalier ou sur un engin de circulation",null,"Autres risques"]
[null,null,null,"E.P.I non fournis ",null,null,"L'inventaire des produits utilisés n'est pas actualisé",null,"Les salariés n'ont pas la possibilité de se laver les mains","Absence de formation","Salariés non formés (caces…)",null,"déplacement non organisé ( manque GPS, méconnaissance des conditions climatiques …)",null,null,null,"Autres risques"]
{"$rows_left_out":6}
{"sheet":"Paramètres 2","index":10,"n_rows":7,"n_cols":3,"rows_kept":7,"cut":false,"hidden":false,"merged":[]}
["Délai d'exécution","Fréquence","Gravité"]
[]
["< 1 mois",1,1]
["1 mois – 3 mois",2,2]
["3 mois – 6 mois",3,3]
["6 mois – 12 mois",4,4]
["> 12 mois"]

{"sheet":"Paramètres 3","index":11,"n_rows":25,"n_cols":2,"rows_kept":25,"cut":false,"hidden":false,"merged":[]}
[{"$f":"'Paramètres 1'!$B$1","v":"Risque lié au bruit*"},"http://www.inrs.fr/media.html?refINRS=ED%206035"]
[{"$f":"'Paramètres 1'!$C$1","v":"Risque lié à l'éclairage"},"http://www.inrs.fr/media.html?refINRS=ED%2085"]
[{"$f":"'Paramètres 1'!$D$1","v":"Risques thermiques*"},"http://www.inrs.fr/risques/environnements-specifiques-de-travail/ce-qu-il-faut-retenir.html"]
[{"$f":"'Paramètres 1'!$E$1","v":"Risques vibrations*"},"http://www.inrs.fr/media.html?refINRS=ED%206018"]
[{"$f":"'Paramètres 1'!$F$1","v":"Risques rayonnements"},"http://www.inrs.fr/media.html?refINRS=ED%20958"]
[{"$f":"'Paramètres 1'!$G$1","v":"Risques chimiques*"},"http://www.inrs.fr/media.html?refINRS=ED%206150"]
[{"$f":"'Paramètres 1'!$H$1","v":"Risques liés au Covid-19"},"http://www.inrs.fr/actualites/COVID-19-et-entreprises.html"]
[{"$f":"'Paramètres 1'!$I$1","v":"Risques biologiques"},"http://www.inrs.fr/media.html?refINRS=ED%206034"]
[{"$f":"'Paramètres 1'!$J$1","v":"Risques liés à la manutention manuelle *"},"http://www.inrs.fr/media.html?refINRS=ED%206161"]
[{"$f":"'Paramètres 1'!$K$1","v":"Risques liés aux circulations et aux déplacements dans l’entreprise"},"http://www.inrs.fr/media.html?refINRS=ED%20975"]
{"$rows_left_out":16}
{"sheet":"Paramètres RPS","index":12,"n_rows":11,"n_cols":10,"rows_kept":11,"cut":false,"hidden":false,"merged":[]}
[null,"Risques liés à l'intensité et à la complexicité du travail","Risques liès aux horaires de travail difficiles","Risques liés aux exigences émotionnelles","Risques liés à une faible autonomie du travail et à l'utilisation des compétence","Risques liés aux rapports sociaux degradés","Risques liés aux conflits de valeur","Risques liés à l'insécurité de l'emploi et du travail","Risques liées à l'organisation du travail ","Risques liés à la malveillance"]
[]
[null,"Contraintes de rythmes élevés","Travail plus de 45 heures par semaine","Situations de tension avec le public","Manque d’autonomie dans la tâche (Pas de choix dans la façon de travailler, pas de possibilité de prendre des initiatives ou pas de possibilité d'action pour organiser et réaliser son travail (choix des techniques, des outils, des mouvements et des gestes) )","Mauvaise qualité des relations entre collègues","Faire un travail en désaccord avec ses valeurs professionnelle","Insécurité socio-économique","Salariés à des postes isolés","Salariés en contact avec le public "]
[null,"Imprécision des objectifs","Travail en horaires atypiques","Confrontation à la souffrance d'autrui","Manque d’autonomie temporelle  (Difficulté ou impossibilité de prendre des temps de pause ou de choisir à quel moment les prendre ou d’organiser son planning selon les priorités et/ou urgences )","Le manque de soutien de la hiérarchie, de l'encadrement ","Travail inutile","Changements incessants ou incompréhensibles, non maîtrisés de la tâche et des conditions de travail ","Absence entretiens individuels ","L’établissement contient  des valeurs  "]
[null,"Inadéquation des objectifs de travail avec les moyens et les responsabilités (manque de ressoureces ou de formation)","Sollicitations en dehors des horaires de travail","Maîtrise des émotions ( Nécessité de maîtriser ses émotions en toutes circonstances, faire bonne figure ) ","Faible utilisation des compétences  (Difficulté ou impossibilité d'utiliser ou de développer ses compétences professionnelles, connaissances, savoir-faire) ","Violence interne au travail","Manque de moyens (technique et/ou organisationnel) pour faire un traviail que les salariés estiment de qualité. ","Incertitude de l'avenir de son métier, peur de devoir changer de qualification ou de métier sans y être préparé ... ","impossibilité de prendre le temps de pause réglementaire","Protection mécanique absente ou en dysfonctionnement (rideaux de fer, grille …)"]
[null,"Mauvaise gestion de la polyvalence (Changement de tâche, de poste ou de fonction à l'improviste )","Horaires imprévisibles : changement de planning non anticipés ","actes de violence vécus","Salariés ne bénéficient pas d’un plan de formation ","Manque de reconnaissance (Rémunération, statut, perspectives de carrière proposées )\n","Autres risques","Absence d'échange, de communicatoin sur les évolutions de l'entreprise, de l'activité, …","Système de rémunération indépendant du salaire ","Moyens de détection absent ou en dysfonctionnement (alarmes, …) "]
[null,"Incompatibilité des instructions entre elles (Ordres ou consignes contradictoires )","Contraintes professionnelles qui ne permettent pas de remplir les obligations de la vie personnelle ","Autres risques","Formation de base insuffisante pour la compréhension des instructions données…","Changement fréquent de personnel ",null,"Autres risques","Autres risques","violences physiques ou verbales d’origine externe "]
[null,"Interruption dans le travail (Tâches imprévues , Attention soutenue et vigilance permanente)","Plannings non connus à l’avance",null,"Défaut de formation suite à un changement d'outils, de technique, de logiciel. ","Relations tendues, conflits entre collègues, concurrence entre services, diminution des collaborations ",null,null,null,"absence de protocole de gestion des incidents liés à la malveillance "]
[null,"Multiplicité des lieux de travail ","Travail de nuit ( entre 21h et 6h)*",null,"Impossibilité des travailleur à agir sur leur situation de travail : méthode, outils, logiciel. ","Autres risques",null,null,null,"Autres risques"]
[null,"impossibilité de prendre le temps de pause réglementaire","Autres risques",null,"absence de diversité sur son poste de travail",null,null,null,null,"Aucune personne formée pour porter secours à un blessé"]
{"$rows_left_out":2}
{"sheet":"Paramètres COVID-19","index":13,"n_rows":19,"n_cols":8,"rows_kept":19,"cut":false,"hidden":false,"merged":[]}
[null,null,null,null,null,null,null,"Mesures organisationnelles/collectives/individuelles"]
[null,null,null,null,null,null,null,"Numéro vert affiché 0800 130 000"]
[null,null,null,null,null,null,null,"Télétravail pour tous les postes qui le permettent"]
[null,null,null,null,null,null,null,"Pour les postes non éligibles au télétravail, les régles de distanciation sont mises en place :\n- Organiser le maintien de l'activité en limitant le nombre de personnes présentes simultanément sur le lieu de travail\n- Eviter les réunions\n- Privilégier les bureaux individuels\n- Favoriser la communication par courrier électronique, téléphone, audioconférence ou visioconférence"]
[null,null,null,null,null,null,null,"Etablir des procédures pour l'accès des visiteurs et des clients :\n - limiter le nombre de visiteurs ou clients et organiser les files d'attente,\n- afficher les consignes générales d'hygiène,\n- mettre à disposition des solutions hydroalcooliques à l'entrée,\n- mettre en place une distance de sécurité, voire des dispositifs spécifiques (interphone écrans)"]
[null,null,null,null,null,null,null,"Enlever les revues et les documents\n des aires d'attente ou des salles communes"]
[null,null,null,null,null,null,null,"Limiter l'accès aux espaces de convivialité et autres lieux de pauses collectives"]
[null,null,null,null,null,null,null,"Veiller à l'approvisionnement des postes de lavage des mains\n en savon et en papier à usage unique,"]
[null,null,null,null,null,null,null,"Veille permamente afin de réévaluer les risques\n en fonction de l'évolution de l'épidémie (stade1,2,3)"]
[null,null,null,null,null,null,null,"Mettre en œuvre un Plan de Continuité d'Activité (PCA)"]
{"$rows_left_out":9}